{"text_format":"1","workbook":"xlsx","n_sheets":14,"sheets":["Data","Fiches_tirage","PO","Forme","Calendrier","Classement Gén","Classement PA","Classement PB","Classement Att","Classement Déf","Classement Réu","Classement Sor","Classement Agr","Classement Spectacle"],"not_rendered":{"charts":3,"images":20,"macros":1,"external_links":0,"defined_names":6,"comments":0,"pivot_tables":0},"unopened":[],"bounds":{"document_bytes":16777216,"sheet_cells":100000,"rows_first":2000,"rows_last":500,"rows_between":2000,"halvings":0,"cell_chars":16384,"cell_head_chars":4096},"cells_cut":0,"cells_raw":0,"read":"whole","date_system":"1900"}

{"sheet":"Data","index":0,"n_rows":100,"n_cols":11,"rows_kept":100,"cut":false,"hidden":false,"merged":[]}
[null,"Coach","Roster","Team",null,null,null,1,"Pistolets Roses (Isequiel - Amazones)","Bourjes (Jolmel - Bas-fonds)",{"$f":" CONCATENATE(I1,\" - \",J1)","v":"Pistolets Roses (Isequiel - Amazones) - Bourjes (Jolmel - Bas-fonds)"}]
["Poule A-1","Didier","Ogres","Machinistes",{"$f":"CONCATENATE(D2,\" (\",B2,\" - \",C2,\")\")","v":"Machinistes (Didier - Ogres)"},null,null,1,"Néfastes & Furious (Chewbac - Gobelins)","Noob's (Virginie - Humains)",{"$f":" CONCATENATE(I2,\" - \",J2)","v":"Néfastes & Furious (Chewbac - Gobelins) - Noob's (Virginie - Humains)"}]
["Poule A-10","ManX","Elfes Pros","Arl'quinquin","Arl'quinquin (ManX - Elfes Pros)",null,null,1,"Rois de Zharr-nagrund (Mik - Nains du Chaos)","Death Battleship (Doz - Morts-vivants)","Rois de Zharr-nagrund (Mik - Nains du Chaos) - Death Battleship (Doz - Morts-vivants)"]
["Poule A-2","Maryan","Bretonniens","Brochettes Quenelloises","Brochettes Quenelloises (Maryan - Bretonniens)",null,null,1,"Tortues Ninjas (Sbartacus - Hommes-Lérads)","YouKorn (Jordel - Démons de Khorne)","Tortues Ninjas (Sbartacus - Hommes-Lérads) - YouKorn (Jordel - Démons de Khorne)"]
["Poule A-3","Kirou","Nordiques","Valhalla Unicorns","Valhalla Unicorns (Kirou - Nordiques)",null,null,1,"Elfiq Froots (Ryo - Elfes Sylvains)","Bloodwind (Sagrigo - Orcs)","Elfiq Froots (Ryo - Elfes Sylvains) - Bloodwind (Sagrigo - Orcs)"]
["Poule A-4","Battleaxe","Orcs","Seattle Seaorcs","Seattle Seaorcs (Battleaxe - Orcs)",null,null,1,"Kazeurs Eud Ku (Anaconda - Orcs)","RCL (Kayvorn - Chaos)","Kazeurs Eud Ku (Anaconda - Orcs) - RCL (Kayvorn - Chaos)"]
["Poule A-5","Winny","Gobs","Karak Ungor Nervous Ulcers","Karak Ungor Nervous Ulcers (Winny - Gobs)",null,null,1,"Elftra Vomit (Blakcheim - Elfes Pros)","The fantastic Crusaders (Radelune - Pacte du Chaos)","Elftra Vomit (Blakcheim - Elfes Pros) - The fantastic Crusaders (Radelune - Pacte du Chaos)"]
["Poule A-6","Vanhu","Chaos","Goat People","Goat People (Vanhu - Chaos)",null,null,1,"Spqr (Will - Hauts Elfes)","Nurgle's Prez (Kroq - Nurgle)","Spqr (Will - Hauts Elfes) - Nurgle's Prez (Kroq - Nurgle)"]
["Poule A-7","Snagrot","Skavens","Courreurs de Malepierre","Courreurs de Malepierre (Snagrot - Skavens)",null,null,1,"Les rats guedins (Madcat - Skavens)","NainsVités (Amshagaar - Nains)","Les rats guedins (Madcat - Skavens) - NainsVités (Amshagaar - Nains)"]
["Poule A-8","BaptSalamander","MV","MLF New Age","MLF New Age (BaptSalamander - MV)",null,null,1,"Errants du Beauvaisis (Guytoo Much - Bretonniens)","Scandinaves (Dracarla - Nordiques)","Errants du Beauvaisis (Guytoo Much - Bretonniens) - Scandinaves (Dracarla - Nordiques)"]
{"$rows_left_out":91}
{"sheet":"Fiches_tirage","index":1,"n_rows":40,"n_cols":8,"rows_kept":40,"cut":false,"hidden":false,"merged":[[1,1,3,1],[1,2,1,4],[1,6,3,6],[1,7,1,9],[2,2,2,4],[2,7,2,9],[3,2,3,4],[3,7,3,9],[5,1,7,1],[5,2,5,4],[5,6,7,6],[5,7,5,9],[6,2,6,4],[6,7,6,9],[7,2,7,4],[7,7,7,9],[9,1,11,1],[9,2,9,4],[9,6,11,6],[9,7,9,9],[10,2,10,4],[10,7,10,9],[11,2,11,4],[11,7,11,9],[13,1,15,1],[13,2,13,4],[13,6,15,6],[13,7,13,9],[14,2,14,4],[14,7,14,9],[15,2,15,4],[15,7,15,9],[17,1,19,1],[17,2,17,4],[17,6,19,6],[17,7,17,9],[18,2,18,4],[18,7,18,9],[19,2,19,4],[19,7,19,9],[21,1,23,1],[21,2,21,4],[21,6,23,6],[21,7,21,9],[22,2,22,4],[22,7,22,9],[23,2,23,4],[23,7,23,9],[25,1,27,1],[25,2,25,4],[25,6,27,6],[25,7,25,9],[26,2,26,4],[26,7,26,9],[27,2,27,4],[27,7,27,9],[29,1,31,1],[29,2,29,4],[29,6,31,6],[29,7,29,9],[30,2,30,4],[30,7,30,9],[31,2,31,4],[31,7,31,9],[33,1,35,1],[33,2,33,4],[33,6,35,6],[33,7,33,9],[34,2,34,4],[34,7,34,9],[35,2,35,4],[35,7,35,9],[37,1,39,1],[37,2,37,4],[37,6,39,6],[37,7,37,9],[38,2,38,4],[38,7,38,9],[39,2,39,4],[39,7,39,9]]}
[]
[null,null,{"$f":"Data!$D2","v":"Machinistes"},null,null,null,null,{"$f":"Data!$D3","v":"Arl'quinquin"}]
[null,null,{"$f":"CONCATENATE(\" (\",Data!$C2,\")\")","v":" (Ogres)"},null,null,null,null,{"$f":"CONCATENATE(\" (\",Data!$C3,\")\")","v":" (Elfes Pros)"}]
[null,null,{"$f":"Data!$B2","v":"Didier"},null,null,null,null,{"$f":"Data!$B3","v":"ManX"}]
[]
[null,null,{"$f":"Data!D4","v":"Brochettes Quenelloises"},null,null,null,null,{"$f":"Data!$D5","v":"Valhalla Unicorns"}]
[null,null,{"$f":"CONCATENATE(\" (\",Data!C4,\")\")","v":" (Bretonniens)"},null,null,null,null,{"$f":"CONCATENATE(\" (\",Data!$C5,\")\")","v":" (Nordiques)"}]
[null,null,{"$f":"Data!B4","v":"Maryan"},null,null,null,null,{"$f":"Data!$B5","v":"Kirou"}]
[]
[null,null,{"$f":"Data!$D6","v":"Seattle Seaorcs"},null,null,null,null,{"$f":"Data!$D7","v":"Karak Ungor Nervous Ulcers"}]
{"$rows_left_out":31}
{"sheet":"PO","index":2,"n_rows":40,"n_cols":33,"rows_kept":40,"cut":false,"hidden":false,"merged":[[1,1,2,27],[1,29,1,30],[1,31,1,32],[3,13,3,15],[3,18,3,20],[3,24,3,26],[6,20,7,20],[7,4,8,4],[7,24,8,24],[8,8,9,8],[8,9,9,9],[8,19,9,19],[8,20,9,20],[9,13,10,13],[5,13,6,13],[6,8,7,8],[6,9,7,9],[6,10,9,10],[6,18,9,18],[6,19,7,19],[13,20,14,20],[14,4,15,4],[14,24,15,24],[15,8,16,8],[15,9,16,9],[15,19,16,19],[15,20,16,20],[16,13,17,13],[12,13,13,13],[13,8,14,8],[13,9,14,9],[13,10,16,10],[13,18,16,18],[13,19,14,19],[21,1,22,27],[21,29,21,30],[24,13,24,15],[24,18,24,20],[24,24,24,26],[27,19,28,19],[27,20,28,20],[28,4,29,4],[28,24,29,24],[29,8,30,8],[29,9,30,9],[29,19,30,19],[29,20,30,20],[30,13,31,13],[26,13,27,13],[27,8,28,8],[27,9,28,9],[27,10,30,10],[27,18,30,18],[34,20,35,20],[35,4,36,4],[35,24,36,24],[36,8,37,8],[36,9,37,9],[36,19,37,19],[36,20,37,20],[37,13,38,13],[33,13,34,13],[34,8,35,8],[34,9,35,9],[34,10,37,10],[34,18,37,18],[34,19,35,19]]}
[]
[null,"MEGABOWL",null,null,null,null,null,null,null,null,null,null,null,null,null,null,null,null,null,null,null,null,null,null,null,null,null,null,null,"Classement Saison",null,"Classement Saison"]
[null,null,null,null,null,null,null,null,null,null,null,null,null,null,null,null,null,null,null,null,null,null,null,null,null,null,null,null,null,"1A",{"$f":"'Classement PA'!C4","v":"Valhalla Unicorns (Kirou - Nordiques)"},"1B",{"$f":"'Classement PB'!C4","v":"Salade Grecque (Aurelnatation - Elfes Sylvains)"}]
[null,null,"Matches de classement",null,null,null,null,null,"Matches de classement",null,null,null,null,"Quarts de finale",null,null,null,null,"Demies finales",null,null,null,null,null,"Finales",null,null,null,null,"2A",{"$f":"'Classement PA'!C5","v":"Machinistes (Didier - Ogres)"},"2B",{"$f":"'Classement PB'!C5","v":"Thunder II (Moute - Nains du chaos)"}]
[null,null,null,null,null,null,null,null,null,null,null,null,null,null,null,null,null,null,null,null,null,null,null,null,null,null,null,null,null,"3A",{"$f":"'Classement PA'!C6","v":"Goat People (Vanhu - Chaos)"},"3B",{"$f":"'Classement PB'!C6","v":"Shadow Unicorns (Guldhan - Elfes Noires)"}]
[null,null,null,null,null,null,null,null,null,null,null,null,null,"A",{"$f":"AE3","v":"Valhalla Unicorns (Kirou - Nordiques)"},null,null,null,null,null,null,null,null,null,null,null,null,null,null,"4A",{"$f":"'Classement PA'!C7","v":"Seattle Seaorcs (Battleaxe - Orcs)"},"4B",{"$f":"'Classement PB'!C7","v":"KbbK (Sebnobi - Hommes lezards)"}]
[null,null,null,null,null,null,null,null,null,{"$f":"IF(AND(ISNUMBER(P6),ISNUMBER(P7)),IF(P6>P7,O7,IF(P7>P6,O6,\"Perdant A\")),\"Perdant A\")","v":"Perdant A"},"G",null,null,null,{"$f":"AG6","v":"KbbK (Sebnobi - Hommes lezards)"},null,null,null,"E",{"$f":"IF(AND(ISNUMBER(P6),ISNUMBER(P7)),IF(P6>P7,O6,IF(P7>P6,O7,\"Vainqueur A\")),\"Vainqueur A\")","v":"Vainqueur A"},null,null,null,null,null,null,null,null,null,"5A",{"$f":"'Classement PA'!C8","v":"Arl'quinquin (ManX - Elfes Pros)"},"5B",{"$f":"'Classement PB'!C8","v":"Skablin Scavengers (Jabba - Bas fonds)"}]
[null,null,null,{"$f":"IF(AND(ISNUMBER(I7),ISNUMBER(I9)),IF(I7>I9,J7,IF(I9>I7,J9,\"Vainqueur G\")),\"Vainqueur G\")","v":"Vainqueur G"},"K",null,null,null,null,null,null,null,null,null,null,null,null,null,null,null,null,null,null,null,"I",{"$f":"IF(AND(ISNUMBER(U7),ISNUMBER(U9)),IF(U7>U9,T7,IF(U9>U7,T9,\"Vainqueur E\")),\"Vainqueur E\")","v":"Vainqueur E"},null,null,null,"6A",{"$f":"'Classement PA'!C9","v":"Courreurs de Malepierre (Snagrot - Skavens)"},"6B",{"$f":"'Classement PB'!C9","v":"UIPP (Jordel - Nurgle)"}]
[null,null,null,{"$f":"IF(AND(ISNUMBER(I14),ISNUMBER(I16)),IF(I14>I16,J14,IF(I16>I14,J16,\"Vainqueur H\")),\"Vainqueur H\")","v":"Vainqueur H"},null,null,null,null,null,{"$f":"IF(AND(ISNUMBER(P10),ISNUMBER(P11)),IF(P10>P11,O11,IF(P11>P10,O10,\"Perdant B\")),\"Perdant B\")","v":"Perdant B"},null,null,null,null,null,null,null,null,null,{"$f":"IF(AND(ISNUMBER(P10),ISNUMBER(P11)),IF(P10>P11,O10,IF(P11>P10,O11,\"Vainqueur B\")),\"Vainqueur B\")","v":"Vainqueur B"},null,null,null,null,null,{"$f":"IF(AND(ISNUMBER(U14),ISNUMBER(U16)),IF(U14>U16,T14,IF(U16>U14,T16,\"Vainqueur F\")),\"Vainqueur F\")","v":"Vainqueur F"},null,null,null,"7A",{"$f":"'Classement PA'!C10","v":"Merdouilles en folie ! (Nard - Gobs)"},"7B",{"$f":"'Classement PB'!C10","v":"Pointy Pretenders (GuttedRunner - Hauts Elfes)"}]
[null,null,null,null,null,null,null,null,null,null,null,null,null,"B",{"$f":"AE5","v":"Goat People (Vanhu - Chaos)"},null,null,null,null,null,null,null,null,null,null,null,null,null,null,"8A",{"$f":"'Classement PA'!C11","v":"Brochettes Quenelloises (Maryan - Bretonniens)"},"8B",{"$f":"'Classement PB'!C11","v":"Kislev Flying Circus (Peco - Slanns)"}]
{"$rows_left_out":31}
{"sheet":"Forme","index":3,"n_rows":69,"n_cols":13,"rows_kept":69,"cut":false,"hidden":false,"merged":[[1,1,1,11],[23,1,23,11],[45,1,45,11],[58,1,58,11]]}
[]
[null,"Série en cours"]
[null,null,"J1","J2","J3","J4","J5","J6","J7","J8","J9","J10"]
[null,"Samaraska Karn (Isequiel - Nécromantiques)","2-2","1-0","3-0","2-0","1-1","1-0","1-1","2-2","2-1","1-1",35]
[null,"France 98 (Dracarla - Humains)","1-1","3-0","2-0","0-2","2-0","1-0","2-1","2-2","1-0","1-2",34]
[null,"Rest In Peace (Jolmel - Nains du Chaos)","1-1","2-1","2-1","2-0","2-1","0-1","1-1","1-0","1-1","0-0",33]
[null,"Polar Beers (Chewbac - Nordiques)","2-0","1-0","1-0","1-1","1-2","1-1","2-0","1-1","0-1","2-1",32]
[null,"Nécros Nécropeu (Coyotte - Nécromantiques)","2-2","1-0","2-0","4-0","1-1","1-0","0-2","0-1","2-0","1-1",31]
[null,"Les éclavagistes Rouges (Radelune - Elfes Noires)","2-4","1-2","0-3","2-0","2-0","1-0","1-0","1-2","1-0","4-1",30]
[null,"B4A - Biffle For All (Jordel - Chaos)","3-0","2-1","0-0","2-2","2-1","0-1","1-1","1-1","1-0","0-0",29]
{"$rows_left_out":60}
{"sheet":"Calendrier","index":4,"n_rows":377,"n_cols":16,"rows_kept":377,"cut":false,"hidden":false,"merged":[[276,1,282,1],[276,2,282,2],[276,6,282,6],[276,7,282,7],[276,9,282,9],[276,10,282,10],[276,14,282,14],[276,15,282,15],[196,1,202,1],[196,2,202,2],[196,6,202,6],[196,7,202,7],[196,9,202,9],[196,10,202,10],[196,14,202,14],[196,15,202,15],[241,14,247,14],[255,1,261,1],[255,2,261,2],[255,6,261,6],[255,7,261,7],[255,9,261,9],[255,10,261,10],[210,15,216,15],[342,15,348,15],[314,15,320,15],[306,2,306,6],[306,10,306,14],[307,1,313,1],[307,2,313,2],[307,6,313,6],[307,7,313,7],[307,9,313,9],[307,10,313,10],[307,14,313,14],[349,15,355,15],[64,1,70,1],[64,2,70,2],[64,6,70,6],[64,7,70,7],[64,9,70,9],[64,10,70,10],[64,14,70,14],[64,15,70,15],[307,15,313,15],[314,1,320,1],[314,2,320,2],[314,6,320,6],[314,7,320,7],[314,9,320,9],[314,10,320,10],[314,14,320,14],[342,1,348,1],[342,2,348,2],[342,6,348,6],[342,7,348,7],[342,9,348,9],[342,10,348,10],[342,14,348,14],[57,15,63,15],[363,1,369,1],[363,2,369,2],[363,6,369,6],[363,7,369,7],[363,9,369,9],[363,10,369,10],[363,14,369,14],[363,15,369,15],[335,1,341,1],[335,2,341,2],[335,6,341,6],[335,7,341,7],[335,9,341,9],[335,10,341,10],[335,14,341,14],[335,15,341,15],[349,1,355,1],[349,2,355,2],[349,6,355,6],[349,7,355,7],[349,9,355,9],[349,10,355,10],[349,14,355,14],[356,1,362,1],[356,2,362,2],[356,6,362,6],[356,7,362,7],[356,9,362,9],[356,10,362,10],[356,14,362,14],[356,15,362,15],[321,1,327,1],[321,2,327,2],[321,6,327,6],[321,7,327,7],[321,9,327,9],[321,10,327,10],[321,14,327,14],[321,15,327,15],[328,1,334,1],[328,2,334,2],[328,6,334,6],[328,7,334,7],[328,9,334,9],[328,10,334,10],[328,14,334,14],[328,15,334,15],[290,1,296,1],[290,2,296,2],[290,6,296,6],[290,7,296,7],[290,9,296,9],[290,10,296,10],[290,14,296,14],[290,15,296,15],[233,2,233,6],[233,10,233,14],[234,1,240,1],[234,2,240,2],[234,6,240,6],[234,7,240,7],[234,9,240,9],[234,10,240,10],[241,10,247,10],[241,15,247,15],[248,1,254,1],[248,2,254,2],[248,6,254,6],[248,7,254,7],[248,9,254,9],[248,10,254,10],[144,15,150,15],[87,2,87,6],[255,14,261,14],[283,1,289,1],[283,2,289,2],[283,6,289,6],[283,7,289,7],[283,9,289,9],[283,10,289,10],[217,15,223,15],[130,1,136,1],[130,2,136,2],[130,6,136,6],[130,7,136,7],[130,9,136,9],[130,10,136,10],[130,14,136,14],[217,1,223,1],[217,2,223,2],[217,6,223,6],[217,7,223,7],[217,9,223,9],[217,10,223,10],[217,14,223,14],[6,2,6,6],[6,10,6,14],[10,2,10,6],[10,10,10,14],[14,2,14,6],[14,10,14,14],[15,1,21,1],[234,14,240,14],[234,15,240,15],[71,1,77,1],[71,2,77,2],[71,6,77,6],[71,7,77,7],[71,9,77,9],[71,10,77,10],[71,14,77,14],[71,15,77,15],[144,1,150,1],[144,2,150,2],[144,6,150,6],[144,7,150,7],[144,9,150,9],[144,10,150,10],[144,14,150,14],[1,2,1,6],[1,10,1,14],[2,2,2,6],[2,10,2,14],[3,2,3,6],[3,10,3,14],[4,2,4,6],[4,10,4,14],[5,2,5,6],[5,10,5,14],[9,2,9,6],[9,10,9,14],[7,2,7,6],[8,2,8,6],[7,10,7,14],[8,10,8,14],[87,10,87,14],[88,1,94,1],[88,2,94,2],[88,6,94,6],[88,7,94,7],[88,9,94,9],[88,10,94,10],[57,1,63,1],[57,2,63,2],[57,6,63,6],[57,7,63,7],[57,9,63,9],[57,10,63,10],[57,14,63,14],[29,1,35,1],[29,2,35,2],[29,6,35,6],[29,7,35,7],[15,15,21,15],[22,1,28,1],[22,2,28,2],[22,6,28,6],[22,7,28,7],[22,9,28,9],[22,10,28,10],[22,14,28,14],[22,15,28,15],[15,2,21,2],[15,6,21,6],[15,7,21,7],[15,9,21,9],[15,10,21,10],[15,14,21,14],[29,9,35,9],[29,10,35,10],[29,14,35,14],[29,15,35,15],[36,1,42,1],[36,2,42,2],[36,6,42,6],[36,7,42,7],[36,9,42,9],[36,10,42,10],[36,14,42,14],[36,15,42,15],[43,1,49,1],[43,2,49,2],[43,6,49,6],[43,7,49,7],[43,9,49,9],[43,10,49,10],[43,14,49,14],[43,15,49,15],[50,1,56,1],[50,2,56,2],[50,6,56,6],[50,7,56,7],[50,9,56,9],[50,10,56,10],[50,14,56,14],[50,15,56,15],[88,14,94,14],[88,15,94,15],[95,1,101,1],[95,2,101,2],[95,6,101,6],[95,7,101,7],[95,9,101,9],[95,10,101,10],[95,14,101,14],[95,15,101,15],[102,1,108,1],[102,2,108,2],[102,6,108,6],[102,7,108,7],[102,9,108,9],[102,10,108,10],[102,14,108,14],[102,15,108,15],[109,1,115,1],[109,2,115,2],[109,6,115,6],[109,7,115,7],[109,9,115,9],[109,10,115,10],[109,14,115,14],[109,15,115,15],[116,15,122,15],[137,1,143,1],[137,2,143,2],[137,6,143,6],[137,7,143,7],[137,9,143,9],[137,10,143,10],[137,14,143,14],[137,15,143,15],[123,1,129,1],[123,2,129,2],[123,6,129,6],[123,7,129,7],[123,9,129,9],[123,10,129,10],[123,14,129,14],[123,15,129,15],[130,15,136,15],[160,10,160,14],[161,1,167,1],[161,2,167,2],[161,6,167,6],[161,7,167,7],[161,9,167,9],[161,10,167,10],[161,14,167,14],[116,1,122,1],[116,2,122,2],[116,6,122,6],[116,7,122,7],[116,9,122,9],[116,10,122,10],[116,14,122,14],[160,2,160,6],[161,15,167,15],[168,1,174,1],[168,2,174,2],[168,6,174,6],[168,7,174,7],[168,9,174,9],[168,10,174,10],[168,14,174,14],[168,15,174,15],[175,15,181,15],[182,1,188,1],[182,2,188,2],[182,6,188,6],[182,7,188,7],[182,9,188,9],[182,10,188,10],[182,14,188,14],[182,15,188,15],[175,10,181,10],[175,14,181,14],[203,1,209,1],[203,2,209,2],[203,6,209,6],[203,7,209,7],[203,9,209,9],[203,10,209,10],[203,14,209,14],[203,15,209,15],[269,10,275,10],[269,14,275,14],[269,15,275,15],[248,14,254,14],[248,15,254,15],[241,1,247,1],[241,2,247,2],[241,6,247,6],[241,7,247,7],[241,9,247,9],[255,15,261,15],[262,1,268,1],[262,2,268,2],[262,6,268,6],[262,7,268,7],[262,9,268,9],[262,10,268,10],[262,14,268,14],[262,15,268,15],[78,15,84,15],[370,1,376,1],[370,2,376,2],[370,6,376,6],[370,7,376,7],[370,9,376,9],[370,10,376,10],[370,14,376,14],[370,15,376,15],[297,1,303,1],[297,2,303,2],[297,6,303,6],[297,7,303,7],[297,9,303,9],[297,10,303,10],[297,14,303,14],[297,15,303,15],[283,14,289,14],[283,15,289,15],[269,1,275,1],[269,2,275,2],[269,6,275,6],[269,7,275,7],[269,9,275,9],[224,15,230,15],[151,1,157,1],[151,2,157,2],[151,6,157,6],[151,7,157,7],[151,9,157,9],[151,10,157,10],[151,14,157,14],[151,15,157,15],[189,1,195,1],[189,2,195,2],[189,6,195,6],[189,7,195,7],[189,9,195,9],[189,10,195,10],[189,14,195,14],[189,15,195,15],[210,1,216,1],[210,2,216,2],[210,6,216,6],[210,7,216,7],[210,9,216,9],[210,10,216,10],[210,14,216,14],[11,2,11,6],[11,10,11,14],[224,1,230,1],[224,2,230,2],[224,6,230,6],[224,7,230,7],[224,9,230,9],[224,10,230,10],[224,14,230,14],[78,1,84,1],[78,2,84,2],[78,6,84,6],[78,7,84,7],[78,9,84,9],[78,10,84,10],[78,14,84,14],[175,1,181,1],[175,2,181,2],[175,6,181,6],[175,7,181,7],[175,9,181,9]]}
[]
[null,null,"Poule A",null,null,null,null,null,null,null,"Poule B"]
[null,null,{"$f":"VLOOKUP(\"Poule A-\"&1, Data!$A$2:$E$21,5,FALSE)","v":"Machinistes (Didier - Ogres)"},null,null,null,null,null,null,null,{"$f":"VLOOKUP(\"Poule B-\"&1, Data!$A$2:$E$21,5,FALSE)","v":"Salade Grecque (Aurelnatation - Elfes Sylvains)"}]
[null,null,{"$f":"VLOOKUP(\"Poule A-\"&2, Data!$A$2:$E$21,5,FALSE)","v":"Brochettes Quenelloises (Maryan - Bretonniens)"},null,null,null,null,null,null,null,{"$f":"VLOOKUP(\"Poule B-\"&2, Data!$A$2:$E$21,5,FALSE)","v":"Chaos bang (Donkydoc - Chaos pact)"}]
[null,null,{"$f":"VLOOKUP(\"Poule A-\"&3, Data!$A$2:$E$21,5,FALSE)","v":"Valhalla Unicorns (Kirou - Nordiques)"},null,null,null,null,null,null,null,{"$f":"VLOOKUP(\"Poule B-\"&3, Data!$A$2:$E$21,5,FALSE)","v":"UIPP (Jordel - Nurgle)"}]
[null,null,{"$f":"VLOOKUP(\"Poule A-\"&4, Data!$A$2:$E$21,5,FALSE)","v":"Seattle Seaorcs (Battleaxe - Orcs)"},null,null,null,null,null,null,null,{"$f":"VLOOKUP(\"Poule B-\"&4, Data!$A$2:$E$21,5,FALSE)","v":"Shadow Unicorns (Guldhan - Elfes Noires)"}]
[null,null,{"$f":"VLOOKUP(\"Poule A-\"&5, Data!$A$2:$E$21,5,FALSE)","v":"Karak Ungor Nervous Ulcers (Winny - Gobs)"},null,null,null,null,null,null,null,{"$f":"VLOOKUP(\"Poule B-\"&5, Data!$A$2:$E$21,5,FALSE)","v":"Thunder II (Moute - Nains du chaos)"}]
[null,null,{"$f":"VLOOKUP(\"Poule A-\"&6, Data!$A$2:$E$21,5,FALSE)","v":"Goat People (Vanhu - Chaos)"},null,null,null,null,null,null,null,{"$f":"VLOOKUP(\"Poule B-\"&6, Data!$A$2:$E$21,5,FALSE)","v":"Canonniers (Rovieli - Humains)"}]
[null,null,{"$f":"VLOOKUP(\"Poule A-\"&7, Data!$A$2:$E$21,5,FALSE)","v":"Courreurs de Malepierre (Snagrot - Skavens)"},null,null,null,null,null,null,null,{"$f":"VLOOKUP(\"Poule B-\"&7, Data!$A$2:$E$21,5,FALSE)","v":"Pointy Pretenders (GuttedRunner - Hauts Elfes)"}]
[null,null,{"$f":"VLOOKUP(\"Poule A-\"&8, Data!$A$2:$E$21,5,FALSE)","v":"MLF New Age (BaptSalamander - MV)"},null,null,null,null,null,null,null,{"$f":"VLOOKUP(\"Poule B-\"&8, Data!$A$2:$E$21,5,FALSE)","v":"Skablin Scavengers (Jabba - Bas fonds)"}]
{"$rows_left_out":368}
{"sheet":"Classement Gén","index":5,"n_rows":23,"n_cols":21,"rows_kept":23,"cut":false,"hidden":false,"merged":[[1,1,1,20]]}
[]
[null,"CLASSEMENT GENERAL"]
[null,"#","Equipe","V","N","D","Nj","Points","TD+","TD-","Pas+","Pas-","Int+","Int-","Sor+","Sor-","Agr+","Agr-","Excl+","Excl-","Affluence Totale"]
[null,1,"Salade Grecque (Aurelnatation - Elfes Sylvains)",4,1,0,0,4452,11,5,5,6,0,0,7,5,0,1,0,1,33000]
[null,2,"Valhalla Unicorns (Kirou - Nordiques)",4,0,1,0,4164,11,3,0,2,0,0,13,6,5,0,0,0,45000]
[null,3,"Thunder II (Moute - Nains du chaos)",4,0,1,0,4138,6,2,0,13,0,0,9,3,2,0,0,0,39000]
[null,4,"Machinistes (Didier - Ogres)",3,1,1,0,3541,4,1,0,3,0,0,14,9,1,0,0,0,35000]
[null,5,"Shadow Unicorns (Guldhan - Elfes Noires)",3,1,1,0,3538,7,5,9,3,0,0,4,4,0,0,0,1,44000]
[null,6,"Goat People (Vanhu - Chaos)",3,0,2,0,3243,7,3,0,4,0,0,11,4,0,1,0,0,21000]
[null,7,"Seattle Seaorcs (Battleaxe - Orcs)",3,0,2,0,3242,6,6,0,2,0,0,12,12,0,4,0,0,51000]
{"$rows_left_out":14}
{"sheet":"Classement PA","index":6,"n_rows":13,"n_cols":21,"rows_kept":13,"cut":false,"hidden":false,"merged":[[1,1,1,20],[3,0,6,0],[7,0,10,0]]}
[]
[null,"CLASSEMENT POULE REIKLAND"]
[null,"#","Equipe","V","N","D","Nj","Points","TD+","TD-","Pas+","Pas-","Int+","Int-","Sor+","Sor-","Agr+","Agr-","Excl+","Excl-","Affluence Totale"]
[null,1,"Valhalla Unicorns (Kirou - Nordiques)",4,0,1,0,4164,11,3,0,2,0,0,13,6,5,0,0,0,45000]
[null,2,"Machinistes (Didier - Ogres)",3,1,1,0,3541,4,1,0,3,0,0,14,9,1,0,0,0,35000]
[null,3,"Goat People (Vanhu - Chaos)",3,0,2,0,3243,7,3,0,4,0,0,11,4,0,1,0,0,21000]
[null,4,"Seattle Seaorcs (Battleaxe - Orcs)",3,0,2,0,3242,6,6,0,2,0,0,12,12,0,4,0,0,51000]
[null,5,"Arl'quinquin (ManX - Elfes Pros)",3,0,2,0,3241,7,6,6,0,0,0,7,10,0,0,0,0,35000]
[null,6,"Courreurs de Malepierre (Snagrot - Skavens)",3,0,2,0,3232,5,5,3,1,0,0,7,7,0,0,0,0,22000]
[null,7,"Merdouilles en folie ! (Nard - Gobs)",3,0,2,0,3230,5,3,0,1,0,0,7,6,1,0,0,0,22000]
{"$rows_left_out":4}
{"sheet":"Classement PB","index":7,"n_rows":13,"n_cols":21,"rows_kept":13,"cut":false,"hidden":false,"merged":[[1,1,1,20],[3,0,6,0],[7,0,10,0]]}
[]
[null,"CLASSEMENT POULE MIDDENLAND"]
[null,"#","Equipe","V","N","D","Nj","Points","TD+","TD-","Pas+","Pas-","Int+","Int-","Sor+","Sor-","Agr+","Agr-","Excl+","Excl-","Affluence Totale"]
[null,1,"Salade Grecque (Aurelnatation - Elfes Sylvains)",4,1,0,0,4452,11,5,5,6,0,0,7,5,0,1,0,1,33000]
[null,2,"Thunder II (Moute - Nains du chaos)",4,0,1,0,4138,6,2,0,13,0,0,9,3,2,0,0,0,39000]
[null,3,"Shadow Unicorns (Guldhan - Elfes Noires)",3,1,1,0,3538,7,5,9,3,0,0,4,4,0,0,0,1,44000]
[null,4,"KbbK (Sebnobi - Hommes lezards)",3,0,2,0,3238,7,6,0,8,0,0,8,2,1,0,1,0,40000]
[null,5,"Skablin Scavengers (Jabba - Bas fonds)",2,2,1,0,2939,6,4,1,4,0,0,10,16,0,0,0,0,31000]
[null,6,"UIPP (Jordel - Nurgle)",1,3,1,0,2337,3,3,3,1,0,0,12,9,1,1,1,0,47000]
[null,7,"Pointy Pretenders (GuttedRunner - Hauts Elfes)",1,1,3,0,1747,8,7,9,1,0,0,7,6,0,2,0,0,39000]
{"$rows_left_out":4}
{"sheet":"Classement Att","index":8,"n_rows":23,"n_cols":6,"rows_kept":23,"cut":false,"hidden":false,"merged":[[1,1,1,5]]}
[]
[null,"Trophée meilleure attaque"]
[null,"#","Equipe","TD+","TD-","Différence"]
[null,1,"Valhalla Unicorns (Kirou - Nordiques)",11,3,8]
[null,2,"Salade Grecque (Aurelnatation - Elfes Sylvains)",11,5,6]
[null,3,"Pointy Pretenders (GuttedRunner - Hauts Elfes)",8,7,1]
[null,4,"Goat People (Vanhu - Chaos)",7,3,4]
[null,5,"Shadow Unicorns (Guldhan - Elfes Noires)",7,5,2]
[null,6,"Arl'quinquin (ManX - Elfes Pros)",7,6,1]
[null,7,"KbbK (Sebnobi - Hommes lezards)",7,6,1]
{"$rows_left_out":14}
{"sheet":"Classement Déf","index":9,"n_rows":23,"n_cols":6,"rows_kept":23,"cut":false,"hidden":false,"merged":[[1,1,1,5]]}
[]
[null,"Trophée meilleure défense"]
[null,"#","Equipe","TD+","TD-","Différence"]
[null,1,"Machinistes (Didier - Ogres)",4,1,3]
[null,2,"Thunder II (Moute - Nains du chaos)",6,2,4]
[null,3,"Valhalla Unicorns (Kirou - Nordiques)",11,3,8]
[null,4,"Goat People (Vanhu - Chaos)",7,3,4]
[null,5,"Merdouilles en folie ! (Nard - Gobs)",5,3,2]
[null,6,"UIPP (Jordel - Nurgle)",3,3,0]
[null,7,"Skablin Scavengers (Jabba - Bas fonds)",6,4,2]
{"$rows_left_out":14}
{"sheet":"Classement Réu","index":10,"n_rows":23,"n_cols":8,"rows_kept":23,"cut":false,"hidden":false,"merged":[[1,1,1,7]]}
[]
[null,"Trophée meilleur passeur"]
[null,"#","Equipe","Pas+","Pas-","Int+","Int-","Total"]
[null,1,"Pointy Pretenders (GuttedRunner - Hauts Elfes)",9,1,0,0,9]
[null,2,"Shadow Unicorns (Guldhan - Elfes Noires)",9,3,0,0,9]
[null,3,"Kislev Flying Circus (Peco - Slanns)",7,3,0,0,7]
[null,4,"Arl'quinquin (ManX - Elfes Pros)",6,0,0,0,6]
[null,5,"Canonniers (Rovieli - Humains)",6,2,0,0,6]
[null,6,"Salade Grecque (Aurelnatation - Elfes Sylvains)",5,6,0,0,5]
[null,7,"Karak Ungor Nervous Ulcers (Winny - Gobs)",4,3,0,0,4]
{"$rows_left_out":14}
{"sheet":"Classement Sor","index":11,"n_rows":23,"n_cols":6,"rows_kept":23,"cut":false,"hidden":false,"merged":[[1,1,1,5]]}
[]
[null,"Trophée meilleur sorteur"]
[null,"#","Equipe","Sor+","Sor-","Différence"]
[null,1,"Machinistes (Didier - Ogres)",14,9,5]
[null,2,"Valhalla Unicorns (Kirou - Nordiques)",13,6,7]
[null,3,"UIPP (Jordel - Nurgle)",12,9,3]
[null,4,"Seattle Seaorcs (Battleaxe - Orcs)",12,12,0]
[null,5,"Goat People (Vanhu - Chaos)",11,4,7]
[null,6,"Chaos bang (Donkydoc - Chaos pact)",10,6,4]
[null,7,"Skablin Scavengers (Jabba - Bas fonds)",10,16,-6]
{"$rows_left_out":14}
{"sheet":"Classement Agr","index":12,"n_rows":23,"n_cols":7,"rows_kept":23,"cut":false,"hidden":false,"merged":[[1,1,1,6]]}
[]
[null,"Trophée meilleur agresseur"]
[null,"#","Equipe","Agr+","Agr-","Excl+","Excl-"]
[null,1,"Valhalla Unicorns (Kirou - Nordiques)",5,0,0,0]
[null,2,"Thunder II (Moute - Nains du chaos)",2,0,0,0]
[null,3,"UIPP (Jordel - Nurgle)",1,1,1,0]
[null,4,"KbbK (Sebnobi - Hommes lezards)",1,0,1,0]
[null,5,"Canonniers (Rovieli - Humains)",1,1,0,0]
[null,6,"Machinistes (Didier - Ogres)",1,0,0,0]
[null,7,"Merdouilles en folie ! (Nard - Gobs)",1,0,0,0]
{"$rows_left_out":14}
{"sheet":"Classement Spectacle","index":13,"n_rows":23,"n_cols":11,"rows_kept":23,"cut":false,"hidden":false,"merged":[[1,1,1,10]]}
[]
[null,"Trophée \"Pour toi public !\""]
[null,"#","Equipe","TD+","Pas+","Int+","Sor+","Agr+","Excl+","% Spectateurs","Total"]
[null,1,"Valhalla Unicorns (Kirou - Nordiques)",11,0,0,13,5,0,7.0000000000000009,29.07]
[null,2,"Pointy Pretenders (GuttedRunner - Hauts Elfes)",8,9,0,7,0,0,6.1,24.061]
[null,3,"Salade Grecque (Aurelnatation - Elfes Sylvains)",11,5,0,7,0,0,5.0999999999999996,23.050999999999998]
[null,4,"UIPP (Jordel - Nurgle)",3,3,0,12,1,1,7.3,20.073]
[null,5,"Shadow Unicorns (Guldhan - Elfes Noires)",7,9,0,4,0,0,6.9,20.068999999999999]
[null,6,"Arl'quinquin (ManX - Elfes Pros)",7,6,0,7,0,0,5.5,20.055]
[null,7,"Canonniers (Rovieli - Humains)",3,6,0,10,1,0,4.1000000000000005,20.041]
{"$rows_left_out":13}